Reaction Details
TargetKappa-type opioid receptor
LigandBDBM50350990
Substrate/Competitorn/a
Meas. Tech.ChEMBL_763681 (CHEMBL1820306)
Ki 2.5±n/a nM
Citation Verhoest, PRBasak, ASParikh, VHayward, MKauffman, GWParadis, VMcHardy, SFMcLean, SGrimwood, SSchmidt, AWVanase-Frawley, MFreeman, JVan Deusen, JCox, LWong, DLiras, S Design and discovery of a selective small molecule¿ opioid antagonist (2-methyl-N-((2'-(pyrrolidin-1-ylsulfonyl)biphenyl-4-yl)methyl)propan-1-amine, PF-4455242). J Med Chem54:5868-77 (2011) 
 
Kappa-type opioid receptor
Name:Kappa-type opioid receptor
Type:G Protein-Coupled Receptor (GPCR)
Mol. Mass.:42648.76
Organism:Homo sapiens (Human)
Description:P41145
Residue:380
BDBM50350990
NameBDBM50350990
Synonyms:CHEMBL1818334
TypeSmall organic molecule
Emp. Form.C18H27NO
Mol. Mass.273.4131
SMILESCC(C)C[C@@]1(CCN(CC2CC2)C1)c1cccc(O)c1