Reaction Details
TargetCholinesterase
LigandBDBM8963
Substrate/Competitorn/a
Meas. Tech.ChEMBL_763956 (CHEMBL1820357)
IC50 5.7±n/a nM
Citation Rizzo, SBisi, ABartolini, MMancini, FBelluti, FGobbi, SAndrisano, VRampa, A Multi-target strategy to address Alzheimer's disease: design, synthesis and biological evaluation of new tacrine-based dimers. Eur J Med Chem46:4336-43 (2011) 
 
Cholinesterase
Name:Cholinesterase
Type:Homotetramer
Mol. Mass.:68422.27
Organism:Homo sapiens (Human)
Description:P06276
Residue:602
BDBM8963
NameBDBM8963
Synonyms:CHEMBL32823 N-[7-(1,2,3,4-tetrahydroacridin-9-ylamino)heptyl]-1,2,3,4-tetrahydroacridin-9-amine Tacrine-Based Inhibitor 2f | tacrine homobivalent compound 3a
TypeSmall organic molecule
Emp. Form.C33H40N4
Mol. Mass.492.6975
SMILESC(CCCNc1c2CCCCc2nc2ccccc12)CCCNc1c2CCCCc2nc2ccccc12