Reaction Details
TargetCorticotropin-releasing factor receptor 1
LigandBDBM50351394
Substrate/Competitorn/a
Meas. Tech.ChEMBL_764455 (CHEMBL1821007)
IC50 6±n/a nM
Citation Saito, TObitsu, TKondo, TMatsui, TNagao, YKusumi, KMatsumura, NUeno, SKishi, AKatsumata, SKagamiishi, YNakai, HToda, M 6,7-Dihydro-5H-cyclopenta[d]pyrazolo[1,5-a]pyrimidines and their derivatives as novel corticotropin-releasing factor 1 receptor antagonists. Bioorg Med Chem19:5432-45 (2011) 
 
Corticotropin-releasing factor receptor 1
Name:Corticotropin-releasing factor receptor 1
Type:Enzyme
Mol. Mass.:50744.31
Organism:Homo sapiens (Human)
Description:P34998
Residue:444
BDBM50351394
NameBDBM50351394
Synonyms:CHEMBL1819084
TypeSmall organic molecule
Emp. Form.C20H25ClN4O
Mol. Mass.372.892
SMILESCCC(CC)Nc1cc(C)nc2c(c(C)nn12)-c1ccc(OC)cc1Cl