Reaction Details
TargetCorticotropin-releasing factor receptor 1
LigandBDBM50087713
Substrate/Competitorn/a
Meas. Tech.ChEMBL_764454 (CHEMBL1821006)
IC50 10±n/a nM
Citation Saito, TObitsu, TKondo, TMatsui, TNagao, YKusumi, KMatsumura, NUeno, SKishi, AKatsumata, SKagamiishi, YNakai, HToda, M 6,7-Dihydro-5H-cyclopenta[d]pyrazolo[1,5-a]pyrimidines and their derivatives as novel corticotropin-releasing factor 1 receptor antagonists. Bioorg Med Chem19:5432-45 (2011) 
 
Corticotropin-releasing factor receptor 1
Name:Corticotropin-releasing factor receptor 1
Type:Enzyme
Mol. Mass.:50744.31
Organism:Homo sapiens (Human)
Description:P34998
Residue:444
BDBM50087713
NameBDBM50087713
Synonyms:(1-Ethyl-propyl)-[3-(4-methoxy-2-methyl-phenyl)-2,5-dimethyl-pyrazolo[1,5-a]pyrimidin-7-yl]-amine DMP-904 | DMP904
TypeSmall organic molecule
Emp. Form.C21H28N4O
Mol. Mass.352.4732
SMILESCCC(CC)Nc1cc(C)nc2c(c(C)nn12)-c1ccc(OC)cc1C