Reaction Details
TargetCorticotropin-releasing factor receptor 1
LigandBDBM50351387
Substrate/Competitorn/a
Meas. Tech.ChEMBL_764453 (CHEMBL1821005)
IC50 7±n/a nM
Citation Saito, TObitsu, TKondo, TMatsui, TNagao, YKusumi, KMatsumura, NUeno, SKishi, AKatsumata, SKagamiishi, YNakai, HToda, M 6,7-Dihydro-5H-cyclopenta[d]pyrazolo[1,5-a]pyrimidines and their derivatives as novel corticotropin-releasing factor 1 receptor antagonists. Bioorg Med Chem19:5432-45 (2011) 
 
Corticotropin-releasing factor receptor 1
Name:Corticotropin-releasing factor receptor 1
Type:G Protein-Coupled Receptor (GPCR)
Mol. Mass.:47870.75
Organism:Rattus norvegicus (rat)
Description:Receptor binding assays were performed using rat cortex homogenate.
Residue:415
BDBM50351387
NameBDBM50351387
Synonyms:CHEMBL1819077
TypeSmall organic molecule
Emp. Form.C22H27ClN4O
Mol. Mass.398.929
SMILESCCC(CC)Nc1c2CCCc2nc2c(c(C)nn12)-c1ccc(OC)cc1Cl