Reaction Details
TargetVascular endothelial growth factor receptor 2
LigandBDBM50327046
Substrate/Competitorn/a
Meas. Tech.ChEMBL_764652 (CHEMBL1821204)
IC50 0.033±n/a nM
Citation Iwata, HImamura, SHori, AHixon, MSKimura, HMiki, H Biochemical characterization of a novel type-II VEGFR2 kinase inhibitor: comparison of binding to non-phosphorylated and phosphorylated VEGFR2. Bioorg Med Chem19:5342-51 (2011) 
 
Vascular endothelial growth factor receptor 2
Name:Vascular endothelial growth factor receptor 2
Type:Receptor Tyrosine Kinase
Mol. Mass.:151510.97
Organism:Homo sapiens (Human)
Description:P35968
Residue:1356
BDBM50327046
NameBDBM50327046
Synonyms:1-(2-fluoro-4-(5-methyl-5H-pyrrolo[3,2-d]pyrimidin-4-yloxy)phenyl)-3-(3-(trifluoromethyl)phenyl)urea CHEMBL1254007 | D3RKN_16
TypeSmall organic molecule
Emp. Form.C21H15F4N5O2
Mol. Mass.445.3697
SMILESCn1ccc2ncnc(Oc3ccc(NC(=O)Nc4cccc(c4)C(F)(F)F)c(F)c3)c12