Reaction Details
TargetHepatocyte growth factor receptor
LigandBDBM24762
Substrate/Competitorn/a
Meas. Tech.ChEMBL_764847 (CHEMBL1826790)
IC50 52±n/a nM
Citation Xie, QQZhong, LPan, YLWang, XYZhou, JPDi-Wu, LHuang, QWang, YLYang, LLXie, HZYang, SY Combined SVM-based and docking-based virtual screening for retrieving novel inhibitors of c-Met. Eur J Med Chem46:3675-80 (2011) 
 
Hepatocyte growth factor receptor
Name:Hepatocyte growth factor receptor
Type:Protein
Mol. Mass.:155559.73
Organism:Homo sapiens (Human)
Description:P08581
Residue:1390
BDBM24762
NameBDBM24762
Synonyms:N-[(5-{4-[(6,7-dimethoxyquinolin-4-yl)oxy]-3-fluorophenyl}-1-methyl-6-oxo-1,6-dihydropyrimidin-2-yl)(phenyl)methyl]-3-(methylsulfanyl)propanamide | pyrimidone, 40
TypeSmall organic molecule
Emp. Form.C33H31FN4O5S
Mol. Mass.614.686
SMILESCOc1cc2nccc(Oc3ccc(cc3F)-c3cnc(C(NC(=O)CCSC)c4ccccc4)n(C)c3=O)c2cc1OC