Reaction Details
TargetHepatocyte growth factor receptor
LigandBDBM28032
Substrate/Competitorn/a
Meas. Tech.ChEMBL_764847 (CHEMBL1826790)
IC50 3.2±n/a nM
Citation Xie, QQZhong, LPan, YLWang, XYZhou, JPDi-Wu, LHuang, QWang, YLYang, LLXie, HZYang, SY Combined SVM-based and docking-based virtual screening for retrieving novel inhibitors of c-Met. Eur J Med Chem46:3675-80 (2011) 
 
Hepatocyte growth factor receptor
Name:Hepatocyte growth factor receptor
Type:Protein
Mol. Mass.:155559.73
Organism:Homo sapiens (Human)
Description:P08581
Residue:1390
BDBM28032
NameBDBM28032
Synonyms:2-aminopyridine analogue, 11 | N-{4-[(2-amino-3-chloropyridin-4-yl)oxy]-3-fluorophenyl}-1-(4-fluorophenyl)-2-oxo-4-(propan-2-yloxy)-1,2-dihydropyridine-3-carboxamide
TypeSmall organic molecule
Emp. Form.C26H21ClF2N4O4
Mol. Mass.526.919
SMILESCC(C)Oc1ccn(-c2ccc(F)cc2)c(=O)c1C(=O)Nc1ccc(Oc2ccnc(N)c2Cl)c(F)c1