Reaction Details
TargetHepatocyte growth factor receptor
LigandBDBM50271979
Substrate/Competitorn/a
Meas. Tech.ChEMBL_764847 (CHEMBL1826790)
IC50 4±n/a nM
Citation Xie, QQZhong, LPan, YLWang, XYZhou, JPDi-Wu, LHuang, QWang, YLYang, LLXie, HZYang, SY Combined SVM-based and docking-based virtual screening for retrieving novel inhibitors of c-Met. Eur J Med Chem46:3675-80 (2011) 
 
Hepatocyte growth factor receptor
Name:Hepatocyte growth factor receptor
Type:Protein
Mol. Mass.:155559.73
Organism:Homo sapiens (Human)
Description:P08581
Residue:1390
BDBM50271979
NameBDBM50271979
Synonyms:1-(3-fluoro-4-(3-(hydroxymethyl)-1H-pyrrolo[2,3-b]pyridin-4-yloxy)phenyl)-3-(2-(4-fluorophenyl)acetyl)urea | CHEMBL499886
TypeSmall organic molecule
Emp. Form.C23H18F2N4O4
Mol. Mass.452.4102
SMILESOCc1c[nH]c2nccc(Oc3ccc(NC(=O)NC(=O)Cc4ccc(F)cc4)cc3F)c12