Reaction Details
TargetHepatocyte growth factor receptor
LigandBDBM50351664
Substrate/Competitorn/a
Meas. Tech.ChEMBL_764847 (CHEMBL1826790)
IC50 0.7±n/a nM
Citation Xie, QQZhong, LPan, YLWang, XYZhou, JPDi-Wu, LHuang, QWang, YLYang, LLXie, HZYang, SY Combined SVM-based and docking-based virtual screening for retrieving novel inhibitors of c-Met. Eur J Med Chem46:3675-80 (2011) 
 
Hepatocyte growth factor receptor
Name:Hepatocyte growth factor receptor
Type:Protein
Mol. Mass.:155559.73
Organism:Homo sapiens (Human)
Description:P08581
Residue:1390
BDBM50351664
NameBDBM50351664
Synonyms:CHEMBL1822368
TypeSmall organic molecule
Emp. Form.C26H28BrN5O5
Mol. Mass.570.435
SMILESO[C@@H]1CCN(CCCNC(=O)c2cc3NC(=O)C(=NNC(=O)Cc4ccc5OCCc5c4)c3c(Br)c2)C1