Reaction Details
TargetAromatase
LigandBDBM7887
Substrate/Competitorn/a
Meas. Tech.ChEMBL_765426 (CHEMBL1828368)
IC50 150±n/a nM
Citation Doiron, JSoultan, AHRichard, RTouré, MMPicot, NRichard, RCuperlovic-Culf, MRobichaud, GATouaibia, M Synthesis and structure-activity relationship of 1- and 2-substituted-1,2,3-triazole letrozole-based analogues as aromatase inhibitors. Eur J Med Chem46:4010-24 (2011) 
 
Aromatase
Name:Aromatase
Type:Enzyme
Mol. Mass.:57888.92
Organism:Homo sapiens (Human)
Description:P11511
Residue:503
BDBM7887
NameBDBM7887
Synonyms:1-Benzylimidazole (BI) 1-benzylimidazole US9138393, 1-benzylimidazole
TypeSmall organic molecule
Emp. Form.C10H10N2
Mol. Mass.158.1998
SMILESC(c1ccccc1)n1ccnc1