Reaction Details
TargetHistone deacetylase 8
LigandBDBM50351944
Substrate/Competitorn/a
Meas. Tech.ChEMBL_766014 (CHEMBL1828143)
IC50 279.5±n/a nM
Citation Huang, WJChen, CCChao, SWYu, CCYang, CYGuh, JHLin, YCKuo, CIYang, PChang, CI Synthesis and evaluation of aliphatic-chain hydroxamates capped with osthole derivatives as histone deacetylase inhibitors. Eur J Med Chem46:4042-9 (2011) 
 
Histone deacetylase 8
Name:Histone deacetylase 8
Type:Enzyme
Mol. Mass.:41749.60
Organism:Homo sapiens (Human)
Description:Q9BY41
Residue:377
BDBM50351944
NameBDBM50351944
Synonyms:CHEMBL1822043
TypeSmall organic molecule
Emp. Form.C22H36N2O6
Mol. Mass.424.531
SMILESCC(C)CCc1c(O)c(CCC(=O)NO)ccc1OCCCCCCCC(=O)NO