Reaction Details
TargetHistone deacetylase 8
LigandBDBM50351945
Substrate/Competitorn/a
Meas. Tech.ChEMBL_766014 (CHEMBL1828143)
IC50 553.45±n/a nM
Citation Huang, WJChen, CCChao, SWYu, CCYang, CYGuh, JHLin, YCKuo, CIYang, PChang, CI Synthesis and evaluation of aliphatic-chain hydroxamates capped with osthole derivatives as histone deacetylase inhibitors. Eur J Med Chem46:4042-9 (2011) 
 
Histone deacetylase 8
Name:Histone deacetylase 8
Type:Enzyme
Mol. Mass.:41749.60
Organism:Homo sapiens (Human)
Description:Q9BY41
Residue:377
BDBM50351945
NameBDBM50351945
Synonyms:CHEMBL1822046
TypeSmall organic molecule
Emp. Form.C21H29NO5
Mol. Mass.375.4587
SMILESCC(C)CCc1c(OCCCCCCC(=O)NO)ccc2ccc(=O)oc12