Reaction Details
TargetHistone deacetylase 6
LigandBDBM50351943
Substrate/Competitorn/a
Meas. Tech.ChEMBL_766016 (CHEMBL1828254)
IC50 15.93±n/a nM
Citation Huang, WJChen, CCChao, SWYu, CCYang, CYGuh, JHLin, YCKuo, CIYang, PChang, CI Synthesis and evaluation of aliphatic-chain hydroxamates capped with osthole derivatives as histone deacetylase inhibitors. Eur J Med Chem46:4042-9 (2011) 
 
Histone deacetylase 6
Name:Histone deacetylase 6
Type:Chromatin regulator; hydrolase; repressor
Mol. Mass.:131381.51
Organism:Homo sapiens (Human)
Description:Q9UBN7
Residue:1215
BDBM50351943
NameBDBM50351943
Synonyms:CHEMBL1822042
TypeSmall organic molecule
Emp. Form.C21H34N2O6
Mol. Mass.410.5045
SMILESCC(C)CCc1c(O)c(CCC(=O)NO)ccc1OCCCCCCC(=O)NO