Reaction Details
TargetHistone deacetylase 1
LigandBDBM19149
Substrate/Competitorn/a
Meas. Tech.ChEMBL_766013 (CHEMBL1828142)
IC50 62.9±n/a nM
Citation Huang, WJChen, CCChao, SWYu, CCYang, CYGuh, JHLin, YCKuo, CIYang, PChang, CI Synthesis and evaluation of aliphatic-chain hydroxamates capped with osthole derivatives as histone deacetylase inhibitors. Eur J Med Chem46:4042-9 (2011) 
 
Histone deacetylase 1
Name:Histone deacetylase 1
Type:Enzyme
Mol. Mass.:55090.27
Organism:Homo sapiens (Human)
Description:Q13547
Residue:482
BDBM19149
NameBDBM19149
Synonyms:CHEMBL98 SAHA US10188756, Compound SAHA US11505523, Compound SAHA US9353061, SAHA US9695181, Vorinostat Zolinza suberoylanilide hydroxamic acid
TypeSmall organic molecule
Emp. Form.C14H20N2O3
Mol. Mass.264.3202
SMILESONC(=O)CCCCCCC(=O)Nc1ccccc1