Reaction Details
TargetSphingosine 1-phosphate receptor 1
LigandBDBM50344807
Substrate/Competitorn/a
Meas. Tech.ChEMBL_766634 (CHEMBL1827200)
IC50>20000±n/a nM
Citation Urbano, MGuerrero, MZhao, JVelaparthi, SSchaeffer, MTBrown, SRosen, HRoberts, E SAR analysis of innovative selective small molecule antagonists of sphingosine-1-phosphate 4 (S1P4) receptor. Bioorg Med Chem Lett21:5470-4 (2011) 
 
Sphingosine 1-phosphate receptor 1
Name:Sphingosine 1-phosphate receptor 1
Type:Enzyme
Mol. Mass.:42836.02
Organism:Homo sapiens (Human)
Description:P21453
Residue:382
BDBM50344807
NameBDBM50344807
Synonyms:5-(2,5-dimethylphenyl)-N-(2,6-dimethylphenyl)furan-2-carboxamide | CHEMBL1779911
TypeSmall organic molecule
Emp. Form.C21H21NO2
Mol. Mass.319.3969
SMILESCc1ccc(C)c(c1)-c1ccc(o1)C(=O)Nc1c(C)cccc1C