Reaction Details
TargetGlycogen synthase kinase-3 alpha
LigandBDBM50229962
Substrate/Competitorn/a
Meas. Tech.ChEMBL_767042 (CHEMBL1828473)
IC50 70000±n/a nM
Citation Monte, FLKramer, TBoländer, APlotkin, BEldar-Finkelman, HFuertes, ADominguez, JSchmidt, B Synthesis and biological evaluation of glycogen synthase kinase 3 (GSK-3) inhibitors: an fast and atom efficient access to 1-aryl-3-benzylureas. Bioorg Med Chem Lett21:5610-5 (2011) 
 
Glycogen synthase kinase-3 alpha
Name:Glycogen synthase kinase-3 alpha
Type:Enzyme
Mol. Mass.:50991.79
Organism:Homo sapiens (Human)
Description:P49840
Residue:483
BDBM50229962
NameBDBM50229962
Synonyms:1-(4-methoxybenzyl)-3-(5-nitrothiazol-2-yl)urea CHEMBL259850 | N-(4-METHOXYBENZYL)-N'-(5-NITRO-1,3-THIAZOL-2-YL)UREA
TypeSmall organic molecule
Emp. Form.C12H12N4O4S
Mol. Mass.308.313
SMILESCOc1ccc(CNC(=O)Nc2ncc(s2)[N+]([O-])=O)cc1