Reaction Details
TargetGlycogen synthase kinase-3 beta
LigandBDBM50352494
Substrate/Competitorn/a
Meas. Tech.ChEMBL_767041 (CHEMBL1828472)
IC50 140000±n/a nM
Citation Monte, FLKramer, TBoländer, APlotkin, BEldar-Finkelman, HFuertes, ADominguez, JSchmidt, B Synthesis and biological evaluation of glycogen synthase kinase 3 (GSK-3) inhibitors: an fast and atom efficient access to 1-aryl-3-benzylureas. Bioorg Med Chem Lett21:5610-5 (2011) 
 
Glycogen synthase kinase-3 beta
Name:Glycogen synthase kinase-3 beta
Type:Enzyme
Mol. Mass.:46756.38
Organism:Homo sapiens (Human)
Description:P49841
Residue:420
BDBM50352494
NameBDBM50352494
Synonyms:CHEMBL1824332
TypeSmall organic molecule
Emp. Form.C17H15N7O2S
Mol. Mass.381.412
SMILESCOc1ccc(CNC(=O)Nc2nc3ccc(cc3s2)-c2nnn[nH]2)cc1