Reaction Details
TargetAurora kinase A
LigandBDBM50352494
Substrate/Competitorn/a
Meas. Tech.ChEMBL_767045 (CHEMBL1828476)
IC50 4800000±n/a nM
Citation Monte, FLKramer, TBoländer, APlotkin, BEldar-Finkelman, HFuertes, ADominguez, JSchmidt, B Synthesis and biological evaluation of glycogen synthase kinase 3 (GSK-3) inhibitors: an fast and atom efficient access to 1-aryl-3-benzylureas. Bioorg Med Chem Lett21:5610-5 (2011) 
 
Aurora kinase A
Name:Aurora kinase A
Type:Serine/threonine-protein kinase
Mol. Mass.:45830.98
Organism:Homo sapiens (Human)
Description:O14965
Residue:403
BDBM50352494
NameBDBM50352494
Synonyms:CHEMBL1824332
TypeSmall organic molecule
Emp. Form.C17H15N7O2S
Mol. Mass.381.412
SMILESCOc1ccc(CNC(=O)Nc2nc3ccc(cc3s2)-c2nnn[nH]2)cc1