Reaction Details
TargetTrypanothione reductase
LigandBDBM50352510
Substrate/Competitorn/a
Meas. Tech.ChEMBL_767157 (CHEMBL1826308)
Ki 13100±n/a nM
Citation Maccari, GJaeger, TMoraca, FBiava, MFlohé, LBotta, M A fast virtual screening approach to identify structurally diverse inhibitors of trypanothione reductase. Bioorg Med Chem Lett21:5255-8 (2011) 
 
Trypanothione reductase
Name:Trypanothione reductase
Type:Homodimer; oxidoreductase
Mol. Mass.:53868.26
Organism:Trypanosoma cruzi
Description:n/a
Residue:492
BDBM50352510
NameBDBM50352510
Synonyms:CHEMBL1824849
TypeSmall organic molecule
Emp. Form.C22H22N4OS2
Mol. Mass.422.566
SMILESCCn1c(SCC(=O)Nc2sc3CCCCc3c2C#N)ncc1-c1ccccc1