Reaction Details
TargetTrypanothione reductase
LigandBDBM60660
Substrate/Competitorn/a
Meas. Tech.ChEMBL_767157 (CHEMBL1826308)
Ki 10600±n/a nM
Citation Maccari, GJaeger, TMoraca, FBiava, MFlohé, LBotta, M A fast virtual screening approach to identify structurally diverse inhibitors of trypanothione reductase. Bioorg Med Chem Lett21:5255-8 (2011) 
 
Trypanothione reductase
Name:Trypanothione reductase
Type:Homodimer; oxidoreductase
Mol. Mass.:53868.26
Organism:Trypanosoma cruzi
Description:n/a
Residue:492
BDBM60660
NameBDBM60660
Synonyms:2-[8-(6-amino-1H-benzimidazol-2-yl)octyl]-3H-benzimidazol-5-amine MLS000764510 [2-[8-(6-amino-1H-benzimidazol-2-yl)octyl]-3H-benzimidazol-5-yl]amine | cid_3096139
TypeSmall organic molecule
Emp. Form.C22H28N6
Mol. Mass.376.4979
SMILESNc1ccc2nc(CCCCCCCCc3nc4ccc(N)cc4[nH]3)[nH]c2c1