Reaction Details
TargetLuciferin 4-monooxygenase
LigandBDBM50352638
Substrate/Competitorn/a
Meas. Tech.ChEMBL_766351 (CHEMBL1826377)
IC50 6400±n/a nM
Citation Xiao, JMarugan, JJZheng, WTitus, SSouthall, NCherry, JJEvans, MAndrophy, EJAustin, CP Discovery, synthesis, and biological evaluation of novel SMN protein modulators. J Med Chem54:6215-33 (2011) 
 
Luciferin 4-monooxygenase
Name:Luciferin 4-monooxygenase
Type:PROTEIN
Mol. Mass.:60126.66
Organism:Luciola lateralis
Description:ChEMBL_786225
Residue:548
BDBM50352638
NameBDBM50352638
Synonyms:CHEMBL1726915
TypeSmall organic molecule
Emp. Form.C16H19N3OS
Mol. Mass.301.407
SMILESCc1ccc(cc1)-c1cnc(s1)N1CCC(CC1)C(N)=O