Reaction Details
TargetCarbonic anhydrase 7
LigandBDBM50352643
Substrate/Competitorn/a
Meas. Tech.ChEMBL_766485 (CHEMBL1826750)
pH7.5±n/a
Ki 60.2±n/a nM
Commentsextracted
Citation Rami, MInnocenti, AMontero, JLScozzafava, AWinum, JYSupuran, CT Synthesis of rhodamine B-benzenesulfonamide conjugates and their inhibitory activity against humana- and bacterial/fungalß-carbonic anhydrases. Bioorg Med Chem Lett21:5210-3 (2011) 
 
Carbonic anhydrase 7
Name:Carbonic anhydrase 7
Type:Enzyme
Mol. Mass.:29664.11
Organism:Homo sapiens (Human)
Description:Human cloned isozyme.
Residue:264
BDBM50352643
NameBDBM50352643
Synonyms:CHEMBL1822699
TypeSmall organic molecule
Emp. Form.C34H36N4O4S
Mol. Mass.596.739
SMILESCCN(CC)c1ccc2c(Oc3cc(ccc3C22N(C(=O)c3ccccc23)c2ccc(cc2)S(N)(=O)=O)N(CC)CC)c1