Reaction Details
TargetCarbonic anhydrase 5A, mitochondrial
LigandBDBM50352644
Substrate/Competitorn/a
Meas. Tech.ChEMBL_766482 (CHEMBL1826747)
pH7.5±n/a
Ki 347±n/a nM
Commentsextracted
Citation Rami, MInnocenti, AMontero, JLScozzafava, AWinum, JYSupuran, CT Synthesis of rhodamine B-benzenesulfonamide conjugates and their inhibitory activity against humana- and bacterial/fungalß-carbonic anhydrases. Bioorg Med Chem Lett21:5210-3 (2011) 
 
Carbonic anhydrase 5A, mitochondrial
Name:Carbonic anhydrase 5A, mitochondrial
Type:Enzyme
Mol. Mass.:34755.54
Organism:Homo sapiens (Human)
Description:Human (cloned) isozyme
Residue:305
BDBM50352644
NameBDBM50352644
Synonyms:CHEMBL1822700
TypeSmall organic molecule
Emp. Form.C34H36N4O4S
Mol. Mass.596.739
SMILESCCN(CC)c1ccc2c(Oc3cc(ccc3C22N(C(=O)c3ccccc23)c2cccc(c2)S(N)(=O)=O)N(CC)CC)c1