Reaction Details
TargetCarbonic anhydrase 12
LigandBDBM50352644
Substrate/Competitorn/a
Meas. Tech.ChEMBL_766487 (CHEMBL1826752)
pH7.5±n/a
Ki 10.5±n/a nM
Commentsextracted
Citation Rami, MInnocenti, AMontero, JLScozzafava, AWinum, JYSupuran, CT Synthesis of rhodamine B-benzenesulfonamide conjugates and their inhibitory activity against humana- and bacterial/fungalß-carbonic anhydrases. Bioorg Med Chem Lett21:5210-3 (2011) 
 
Carbonic anhydrase 12
Name:Carbonic anhydrase 12
Type:Enzyme
Mol. Mass.:39456.00
Organism:Homo sapiens (Human)
Description:Catalytic domain of human cloned isozyme was used in the assay
Residue:354
BDBM50352644
NameBDBM50352644
Synonyms:CHEMBL1822700
TypeSmall organic molecule
Emp. Form.C34H36N4O4S
Mol. Mass.596.739
SMILESCCN(CC)c1ccc2c(Oc3cc(ccc3C22N(C(=O)c3ccccc23)c2cccc(c2)S(N)(=O)=O)N(CC)CC)c1