Reaction Details
TargetCarbonic anhydrase 1
LigandBDBM50352645
Substrate/Competitorn/a
Meas. Tech.ChEMBL_766478 (CHEMBL1826743)
pH7.5±n/a
Ki 714±n/a nM
Commentsextracted
Citation Rami, MInnocenti, AMontero, JLScozzafava, AWinum, JYSupuran, CT Synthesis of rhodamine B-benzenesulfonamide conjugates and their inhibitory activity against humana- and bacterial/fungalß-carbonic anhydrases. Bioorg Med Chem Lett21:5210-3 (2011) 
 
Carbonic anhydrase 1
Name:Carbonic anhydrase 1
Type:Enzyme
Mol. Mass.:28873.37
Organism:Homo sapiens (Human)
Description:P00915
Residue:261
BDBM50352645
NameBDBM50352645
Synonyms:CHEMBL1822701
TypeSmall organic molecule
Emp. Form.C35H38N4O4S
Mol. Mass.610.766
SMILESCCN(CC)c1ccc2c(Oc3cc(ccc3C22N(Cc3ccc(cc3)S(N)(=O)=O)C(=O)c3ccccc23)N(CC)CC)c1