Reaction Details
TargetRenin
LigandBDBM50352891
Substrate/Competitorn/a
Meas. Tech.ChEMBL_767618 (CHEMBL1825730)
IC50 6±n/a nM
Citation Matter, HScheiper, BSteinhagen, HBöcskei, ZFleury, VMcCort, G Structure-based design and optimization of potent renin inhibitors on 5- or 7-azaindole-scaffolds. Bioorg Med Chem Lett21:5487-92 (2011) 
 
Renin
Name:Renin
Type:Enzyme
Mol. Mass.:45058.99
Organism:Homo sapiens (Human)
Description:n/a
Residue:406
BDBM50352891
NameBDBM50352891
Synonyms:CHEMBL1824645
TypeSmall organic molecule
Emp. Form.C27H27FN4O2
Mol. Mass.458.5273
SMILESCOc1cc2n(c(Cc3cccc(F)c3C)c(C(=O)N3CCNCC3)c2cn1)-c1ccccc1