Reaction Details
TargetRenin
LigandBDBM50352961
Substrate/Competitorn/a
Meas. Tech.ChEMBL_767701 (CHEMBL1825813)
IC50 30±n/a nM
Citation Scheiper, BMatter, HSteinhagen, HBöcskei, ZFleury, VMcCort, G Structure-based optimization of potent 4- and 6-azaindole-3-carboxamides as renin inhibitors. Bioorg Med Chem Lett21:5480-6 (2011) 
 
Renin
Name:Renin
Type:Enzyme
Mol. Mass.:45058.99
Organism:Homo sapiens (Human)
Description:n/a
Residue:406
BDBM50352961
NameBDBM50352961
Synonyms:CHEMBL1824935
TypeSmall organic molecule
Emp. Form.C26H26N4O2
Mol. Mass.426.5102
SMILESCc1cccc(C)c1Oc1c(C(=O)N2CCNCC2)c2ncccc2n1-c1ccccc1