Reaction Details
TargetALK tyrosine kinase receptor/Nucleophosmin
LigandBDBM50353044
Substrate/Competitorn/a
Meas. Tech.ChEMBL_767867 (CHEMBL1825979)
IC50 70±n/a nM
Citation Ott, GRWells, GJThieu, TVQuail, MRLisko, JGMesaros, EFGingrich, DEGhose, AKWan, WLu, LCheng, MAlbom, MSAngeles, TSHuang, ZAimone, LDAtor, MARuggeri, BADorsey, BD 2,7-disubstituted-pyrrolo[2,1-f][1,2,4]triazines: new variant of an old template and application to the discovery of anaplastic lymphoma kinase (ALK) inhibitors with in vivo antitumor activity. J Med Chem54:6328-41 (2011) 
 
ALK tyrosine kinase receptor/Nucleophosmin
Name:ALK tyrosine kinase receptor/Nucleophosmin
Synonyms:NPM/ALK (Nucleophosmin/ALK tyrosine kinase receptor)
Type:n/a
Mol. Mass.:n/a
Description:ASSAY_ID of EBI is 331455
Components:This complex has 2 components.
Component 1
Name:ALK tyrosine kinase receptor
Type:Protein
Mol. Mass.:176453.10
Organism:Homo sapiens (Human)
Description:Q9UM73
Residue:1620
Component 2
Name:Nucleophosmin
Synonyms:NPM NPM1 | NPM_HUMAN
Type:PROTEIN
Mol. Mass.:32552.99
Organism:Homo sapiens (Human)
Description:ChEMBL_1502715
Residue:294
Component 3
Name:ALK tyrosine kinase receptor
Synonyms:ALK ALK_HUMAN CD_antigen: CD246
Type:Protein
Mol. Mass.:176453.10
Organism:Homo sapiens (Human)
Description:Q9UM73
Residue:1620
BDBM50353044
NameBDBM50353044
Synonyms:CHEMBL1822523
TypeSmall organic molecule
Emp. Form.C29H36N8O2
Mol. Mass.528.6485
SMILESCOc1ccccc1-c1ccc2cnc(Nc3ccc(cc3OC)N3CCN(CC3)N3CCN(C)CC3)nn12