Reaction Details
TargetSodium/hydrogen exchanger 1
LigandBDBM50353097
Substrate/Competitorn/a
Meas. Tech.ChEMBL_768436 (CHEMBL1832155)
IC50 0.31±n/a nM
Citation Jin, LJiang, XMDu, PXu, JGong, GQWang, QJXu, YG Synthesis and Na+/H+ exchanger inhibitory activity of benzoylguanidine derivatives. Eur J Med Chem46:4107-16 (2011) 
 
Sodium/hydrogen exchanger 1
Name:Sodium/hydrogen exchanger 1
Type:PROTEIN
Mol. Mass.:91655.00
Organism:Rattus norvegicus
Description:ChEMBL_862370
Residue:820
BDBM50353097
NameBDBM50353097
Synonyms:CHEMBL1829132
TypeSmall organic molecule
Emp. Form.C32H39N7O8
Mol. Mass.649.6942
SMILESCOc1ccc(CN2CCN(CCCOc3ccc(cc3NC(=O)c3ccccc3[N+]([O-])=O)C(=O)NC(N)=N)CC2)c(OC)c1OC