Reaction Details
TargetSodium/hydrogen exchanger 1
LigandBDBM50353114
Substrate/Competitorn/a
Meas. Tech.ChEMBL_768436 (CHEMBL1832155)
IC50 0.091±n/a nM
Citation Jin, LJiang, XMDu, PXu, JGong, GQWang, QJXu, YG Synthesis and Na+/H+ exchanger inhibitory activity of benzoylguanidine derivatives. Eur J Med Chem46:4107-16 (2011) 
 
Sodium/hydrogen exchanger 1
Name:Sodium/hydrogen exchanger 1
Type:PROTEIN
Mol. Mass.:91655.00
Organism:Rattus norvegicus
Description:ChEMBL_862370
Residue:820
BDBM50353114
NameBDBM50353114
Synonyms:CHEMBL1829126
TypeSmall organic molecule
Emp. Form.C29H36N6O6S
Mol. Mass.596.698
SMILESCOc1ccc(CN2CCN(CCOc3ccc(cc3NC(=O)c3cccs3)C(=O)NC(N)=N)CC2)c(OC)c1OC