Reaction Details
TargetProtein-S-isoprenylcysteine O-methyltransferase
LigandBDBM50353182
Substrate/Competitorn/a
Meas. Tech.ChEMBL_768735 (CHEMBL1831608)
IC50 19400±n/a nM
Citation Bergman, JAHahne, KHrycyna, CAGibbs, RA Lipid and sulfur substituted prenylcysteine analogs as human Icmt inhibitors. Bioorg Med Chem Lett21:5616-9 (2011) 
 
Protein-S-isoprenylcysteine O-methyltransferase
Name:Protein-S-isoprenylcysteine O-methyltransferase
Type:PROTEIN
Mol. Mass.:31943.26
Organism:Homo sapiens (Human)
Description:ChEMBL_956034
Residue:284
BDBM50353182
NameBDBM50353182
Synonyms:CHEMBL1829501
TypeSmall organic molecule
Emp. Form.C33H40N4O4
Mol. Mass.556.6951
SMILES[#6]\[#6](-[#6])=[#6]\[#6]-[#6]\[#6](-[#6])=[#6]\[#6]-[#6]\[#6](-[#6])=[#6]\[#6]-c1cn(-[#6]-[#6@H](-[#7]-[#6](=O)-c2ccccc2-[#8]-c2ccccc2)-[#6](-[#8])=O)nn1