Reaction Details
TargetHistone deacetylase 1
LigandBDBM50248522
Substrate/Competitorn/a
Meas. Tech.ChEMBL_769057 (CHEMBL1832520)
Ki 12±n/a nM
Citation Wang, HYu, NChen, DLee, KCLye, PLChang, JWDeng, WNg, MCLu, TKhoo, MLPoulsen, ASangthongpitag, KWu, XHu, CGoh, KCWang, XFang, LGoh, KLKhng, HHGoh, SKYeo, PLiu, XBonday, ZWood, JMDymock, BWKantharaj, ESun, ET Discovery of (2E)-3-{2-butyl-1-[2-(diethylamino)ethyl]-1H-benzimidazol-5-yl}-N-hydroxyacrylamide (SB939), an orally active histone deacetylase inhibitor with a superior preclinical profile. J Med Chem54:4694-720 (2011) 
 
Histone deacetylase 1
Name:Histone deacetylase 1
Type:Enzyme
Mol. Mass.:55090.27
Organism:Homo sapiens (Human)
Description:Q13547
Residue:482
BDBM50248522
NameBDBM50248522
Synonyms:CHEMBL489332 US10201527, Compound 67 US8551988, 67
TypeSmall organic molecule
Emp. Form.C25H30N4O2
Mol. Mass.418.5313
SMILESONC(=O)\C=C\c1ccc2n(CCN3CCCCC3)c(CCc3ccccc3)nc2c1