Reaction Details
TargetPolyamine deacetylase HDAC10
LigandBDBM50353231
Substrate/Competitorn/a
Meas. Tech.ChEMBL_769066 (CHEMBL1832529)
Ki 29±n/a nM
Citation Wang, HYu, NChen, DLee, KCLye, PLChang, JWDeng, WNg, MCLu, TKhoo, MLPoulsen, ASangthongpitag, KWu, XHu, CGoh, KCWang, XFang, LGoh, KLKhng, HHGoh, SKYeo, PLiu, XBonday, ZWood, JMDymock, BWKantharaj, ESun, ET Discovery of (2E)-3-{2-butyl-1-[2-(diethylamino)ethyl]-1H-benzimidazol-5-yl}-N-hydroxyacrylamide (SB939), an orally active histone deacetylase inhibitor with a superior preclinical profile. J Med Chem54:4694-720 (2011) 
 
Polyamine deacetylase HDAC10
Name:Polyamine deacetylase HDAC10
Type:Chromatin regulator; hydrolase; repressor
Mol. Mass.:71431.89
Organism:Homo sapiens (Human)
Description:Q969S8
Residue:669
BDBM50353231
NameBDBM50353231
Synonyms:CHEMBL1830422
TypeSmall organic molecule
Emp. Form.C21H32N4O2
Mol. Mass.372.5044
SMILESCCCCCCc1nc2cc(\C=C\C(=O)NO)ccc2n1CCNC(C)C