Reaction Details
TargetCystic fibrosis transmembrane conductance regulator
LigandBDBM50353351
Substrate/Competitorn/a
Meas. Tech.ChEMBL_769084 (CHEMBL1832641)
IC50 40±n/a nM
Citation Snyder, DSTradtrantip, LYao, CKurth, MJVerkman, AS Potent, metabolically stable benzopyrimido-pyrrolo-oxazine-dione (BPO) CFTR inhibitors for polycystic kidney disease. J Med Chem54:5468-77 (2011) 
 
Cystic fibrosis transmembrane conductance regulator
Name:Cystic fibrosis transmembrane conductance regulator
Type:Enzyme Catalytic Domain
Mol. Mass.:168171.30
Organism:Homo sapiens (Human)
Description:gi_90421313
Residue:1480
BDBM50353351
NameBDBM50353351
Synonyms:CHEMBL1831075
TypeSmall organic molecule
Emp. Form.C26H18BrN3O6
Mol. Mass.548.342
SMILESCn1c2c3C(Oc4ccc(cc4-n3c(-c3ccccc3)c2c(=O)n(C)c1=O)C(O)=O)c1ccc(Br)o1