Reaction Details
TargetCystic fibrosis transmembrane conductance regulator
LigandBDBM50353338
Substrate/Competitorn/a
Meas. Tech.ChEMBL_769085 (CHEMBL1832642)
IC50 50±n/a nM
Citation Snyder, DSTradtrantip, LYao, CKurth, MJVerkman, AS Potent, metabolically stable benzopyrimido-pyrrolo-oxazine-dione (BPO) CFTR inhibitors for polycystic kidney disease. J Med Chem54:5468-77 (2011) 
 
Cystic fibrosis transmembrane conductance regulator
Name:Cystic fibrosis transmembrane conductance regulator
Type:Enzyme Catalytic Domain
Mol. Mass.:168171.30
Organism:Homo sapiens (Human)
Description:gi_90421313
Residue:1480
BDBM50353338
NameBDBM50353338
Synonyms:CHEMBL1831058
TypeSmall organic molecule
Emp. Form.C25H19BrN4O3
Mol. Mass.503.347
SMILESCn1c2c3C(Nc4ccccc4-n3c(-c3ccccc3)c2c(=O)n(C)c1=O)c1ccc(Br)o1