Reaction Details
TargetCystic fibrosis transmembrane conductance regulator
LigandBDBM50353346
Substrate/Competitorn/a
Meas. Tech.ChEMBL_769085 (CHEMBL1832642)
IC50 25±n/a nM
Citation Snyder, DSTradtrantip, LYao, CKurth, MJVerkman, AS Potent, metabolically stable benzopyrimido-pyrrolo-oxazine-dione (BPO) CFTR inhibitors for polycystic kidney disease. J Med Chem54:5468-77 (2011) 
 
Cystic fibrosis transmembrane conductance regulator
Name:Cystic fibrosis transmembrane conductance regulator
Type:Enzyme Catalytic Domain
Mol. Mass.:168171.30
Organism:Homo sapiens (Human)
Description:gi_90421313
Residue:1480
BDBM50353346
NameBDBM50353346
Synonyms:CHEMBL1831070
TypeSmall organic molecule
Emp. Form.C26H20N4O6
Mol. Mass.484.4602
SMILESCc1ccc(o1)C1Oc2ccc(cc2-n2c1c1n(C)c(=O)n(C)c(=O)c1c2-c1ccccc1)[N+]([O-])=O