Reaction Details
TargetAndrogen receptor
LigandBDBM50353542
Substrate/Competitorn/a
Meas. Tech.ChEMBL_768071 (CHEMBL1833027)
IC50 32±n/a nM
Citation Sexton, KEBarrett, SBridgwood, KCarroll, MDettling, DDu, DFakhoury, SFedij, VHu, LYKostlan, CPocalyko, DRaheja, NSmith, YShanmugasundaram, VWade, K Pantolactams as androgen receptor antagonists for the topical suppression of sebum production. Bioorg Med Chem Lett21:5230-3 (2011) 
 
Androgen receptor
Name:Androgen receptor
Type:Receptor
Mol. Mass.:99185.27
Organism:Homo sapiens (Human)
Description:CHO cells were stably transfected with human AR gene.
Residue:920
BDBM50353542
NameBDBM50353542
Synonyms:CHEMBL1830779
TypeSmall organic molecule
Emp. Form.C18H21F3N2O2
Mol. Mass.354.3667
SMILESCCC(C)N1CC(C)(C)C(Oc2ccc(C#N)c(c2)C(F)(F)F)C1=O