Reaction Details
TargetAndrogen receptor
LigandBDBM50353540
Substrate/Competitorn/a
Meas. Tech.ChEMBL_768071 (CHEMBL1833027)
IC50 32±n/a nM
Citation Sexton, KEBarrett, SBridgwood, KCarroll, MDettling, DDu, DFakhoury, SFedij, VHu, LYKostlan, CPocalyko, DRaheja, NSmith, YShanmugasundaram, VWade, K Pantolactams as androgen receptor antagonists for the topical suppression of sebum production. Bioorg Med Chem Lett21:5230-3 (2011) 
 
Androgen receptor
Name:Androgen receptor
Type:Receptor
Mol. Mass.:99185.27
Organism:Homo sapiens (Human)
Description:CHO cells were stably transfected with human AR gene.
Residue:920
BDBM50353540
NameBDBM50353540
Synonyms:CHEMBL1830945
TypeSmall organic molecule
Emp. Form.C21H19F3N2O3
Mol. Mass.404.3824
SMILESCC1(C)CN(Cc2ccc(O)cc2)C(=O)C1Oc1ccc(C#N)c(c1)C(F)(F)F