Reaction Details
TargetThromboxane A2 receptor
LigandBDBM50353632
Substrate/Competitorn/a
Meas. Tech.ChEMBL_769810 (CHEMBL1831674)
IC50 5.8±n/a nM
Citation Ballatore, CSoper, JHPiscitelli, FJames, MHuang, LAtasoylu, OHuryn, DMTrojanowski, JQLee, VMBrunden, KRSmith, AB Cyclopentane-1,3-dione: a novel isostere for the carboxylic acid functional group. Application to the design of potent thromboxane (A2) receptor antagonists. J Med Chem54:6969-83 (2011) 
 
Thromboxane A2 receptor
Name:Thromboxane A2 receptor
Type:Enzyme Catalytic Domain
Mol. Mass.:37114.77
Organism:MOUSE
Description:Thromboxane A2 TBXA2R MOUSE::P30987
Residue:341
BDBM50353632
NameBDBM50353632
Synonyms:CHEMBL1829812
TypeSmall organic molecule
Emp. Form.C24H28ClNO4S
Mol. Mass.462.001
SMILESOC1CC(Cc2cccc(CCNS(=O)(=O)c3ccc(Cl)cc3)c2)C(=O)C1CC1CC1