Reaction Details
TargetThromboxane A2 receptor
LigandBDBM50353635
Substrate/Competitorn/a
Meas. Tech.ChEMBL_769809 (CHEMBL1831673)
IC50 64±n/a nM
Citation Ballatore, CSoper, JHPiscitelli, FJames, MHuang, LAtasoylu, OHuryn, DMTrojanowski, JQLee, VMBrunden, KRSmith, AB Cyclopentane-1,3-dione: a novel isostere for the carboxylic acid functional group. Application to the design of potent thromboxane (A2) receptor antagonists. J Med Chem54:6969-83 (2011) 
 
Thromboxane A2 receptor
Name:Thromboxane A2 receptor
Type:Enyzme
Mol. Mass.:37445.28
Organism:Homo sapiens (Human)
Description:P21731
Residue:343
BDBM50353635
NameBDBM50353635
Synonyms:CHEMBL1829801
TypeSmall organic molecule
Emp. Form.C17H18ClN5O2S
Mol. Mass.391.875
SMILESClc1ccc(cc1)S(=O)(=O)NCCc1cccc(CCc2nnn[nH]2)c1