Reaction Details
TargetThromboxane A2 receptor
LigandBDBM50353639
Substrate/Competitorn/a
Meas. Tech.ChEMBL_769810 (CHEMBL1831674)
IC50 3.1±n/a nM
Citation Ballatore, CSoper, JHPiscitelli, FJames, MHuang, LAtasoylu, OHuryn, DMTrojanowski, JQLee, VMBrunden, KRSmith, AB Cyclopentane-1,3-dione: a novel isostere for the carboxylic acid functional group. Application to the design of potent thromboxane (A2) receptor antagonists. J Med Chem54:6969-83 (2011) 
 
Thromboxane A2 receptor
Name:Thromboxane A2 receptor
Type:Enzyme Catalytic Domain
Mol. Mass.:37114.77
Organism:MOUSE
Description:Thromboxane A2 TBXA2R MOUSE::P30987
Residue:341
BDBM50353639
NameBDBM50353639
Synonyms:CHEMBL1829806
TypeSmall organic molecule
Emp. Form.C21H22ClNO4S
Mol. Mass.419.922
SMILESCC1C(=O)CC(Cc2cccc(CCNS(=O)(=O)c3ccc(Cl)cc3)c2)C1=O