Reaction Details
TargetChloroquine resistance transporter
LigandBDBM50353745
Substrate/Competitorn/a
Meas. Tech.ChEMBL_769822 (CHEMBL1831816)
IC50 69000±n/a nM
Citation Zishiri, VKJoshi, MCHunter, RChibale, KSmith, PJSummers, RLMartin, REEgan, TJ Quinoline antimalarials containing a dibemethin group are active against chloroquinone-resistant Plasmodium falciparum and inhibit chloroquine transport via the P. falciparum chloroquine-resistance transporter (PfCRT). J Med Chem54:6956-68 (2011) 
 
Chloroquine resistance transporter
Name:Chloroquine resistance transporter
Type:PROTEIN
Mol. Mass.:48687.29
Organism:Plasmodium falciparum
Description:ChEMBL_1364181
Residue:424
BDBM50353745
NameBDBM50353745
Synonyms:CHEMBL1830987
TypeSmall organic molecule
Emp. Form.C25H24ClN3
Mol. Mass.401.931
SMILESCN(Cc1ccccc1)Cc1ccc(CNc2ccnc3cc(Cl)ccc23)cc1