Reaction Details
TargetD-amino-acid oxidase
LigandBDBM23174
Substrate/Competitorn/a
Meas. Tech.ChEMBL_769921 (CHEMBL1832105)
IC50 17.2±n/a nM
Citation Lange, JHVenhorst, Jvan Dongen, MJFrankena, JBassissi, Fde Bruin, NMden Besten, Cde Beer, SBOostenbrink, CMarkova, NKruse, CG Biophysical and physicochemical methods differentiate highly ligand-efficient human D-amino acid oxidase inhibitors. Eur J Med Chem46:4808-19 (2011) 
 
D-amino-acid oxidase
Name:D-amino-acid oxidase
Type:Homodimer
Mol. Mass.:39476.06
Organism:Homo sapiens (Human)
Description:P14920
Residue:347
BDBM23174
NameBDBM23174
Synonyms:6-chloro-1,2-benzoxazol-3-ol CBIO | CHEMBL445990
TypeSmall organic molecule
Emp. Form.C7H4ClNO2
Mol. Mass.169.565
SMILESClc1ccc2c(c1)o[nH]c2=O