Reaction Details
TargetD-amino-acid oxidase
LigandBDBM31147
Substrate/Competitorn/a
Meas. Tech.ChEMBL_769924 (CHEMBL1832108)
Kd 3.1±n/a nM
Citation Lange, JHVenhorst, Jvan Dongen, MJFrankena, JBassissi, Fde Bruin, NMden Besten, Cde Beer, SBOostenbrink, CMarkova, NKruse, CG Biophysical and physicochemical methods differentiate highly ligand-efficient human D-amino acid oxidase inhibitors. Eur J Med Chem46:4808-19 (2011) 
 
D-amino-acid oxidase
Name:D-amino-acid oxidase
Type:Homodimer
Mol. Mass.:39476.06
Organism:Homo sapiens (Human)
Description:P14920
Residue:347
BDBM31147
NameBDBM31147
Synonyms:4H-furo[3,2-b]pyrrole-5-carboxylic acid CHEMBL492591
TypeSmall organic molecule
Emp. Form.C7H5NO3
Mol. Mass.151.1195
SMILESOC(=O)c1cc2occc2[nH]1