Reaction Details
TargetAcetylcholine-binding protein
LigandBDBM50419178
Substrate/Competitorn/a
Meas. Tech.ChEMBL_770043 (CHEMBL1832418)
Ki 630.96±n/a nM
Citation Akdemir, ARucktooa, PJongejan, AElk, RBertrand, SSixma, TKBertrand, DSmit, ABLeurs, Rde Graaf, Cde Esch, IJ Acetylcholine binding protein (AChBP) as template for hierarchical in silico screening procedures to identify structurally novel ligands for the nicotinic receptors. Bioorg Med Chem19:6107-19 (2011) 
 
Acetylcholine-binding protein
Name:Acetylcholine-binding protein
Type:n/a
Mol. Mass.:26055.52
Organism:Lymnaea stagnalis
Description:Soluble acetylcholine receptor
Residue:229
BDBM50419178
NameBDBM50419178
Synonyms:CHEMBL1831029
TypeSmall organic molecule
Emp. Form.C17H23N2
Mol. Mass.255.3774
SMILESCC1CC[N+]2(C)CCc3c([nH]c4ccccc34)C2C1