Reaction Details
TargetAcetylcholine-binding protein
LigandBDBM50419200
Substrate/Competitorn/a
Meas. Tech.ChEMBL_770043 (CHEMBL1832418)
Ki 1584.89±n/a nM
Citation Akdemir, ARucktooa, PJongejan, AElk, RBertrand, SSixma, TKBertrand, DSmit, ABLeurs, Rde Graaf, Cde Esch, IJ Acetylcholine binding protein (AChBP) as template for hierarchical in silico screening procedures to identify structurally novel ligands for the nicotinic receptors. Bioorg Med Chem19:6107-19 (2011) 
 
Acetylcholine-binding protein
Name:Acetylcholine-binding protein
Type:n/a
Mol. Mass.:26055.52
Organism:Lymnaea stagnalis
Description:Soluble acetylcholine receptor
Residue:229
BDBM50419200
NameBDBM50419200
Synonyms:CHEMBL1740345
TypeSmall organic molecule
Emp. Form.C19H23ClN2
Mol. Mass.314.852
SMILESClC1(CNc2ccccc2)CCN(Cc2ccccc2)CC1