Reaction Details
TargetMyelin-associated glycoprotein
LigandBDBM50354045
Substrate/Competitorn/a
Meas. Tech.ChEMBL_770761 (CHEMBL1837431)
Kd 1.8E5±n/a nM
Citation Zeng, YRademacher, CNycholat, CMFutakawa, SLemme, KErnst, BPaulson, JC High affinity sialoside ligands of myelin associated glycoprotein. Bioorg Med Chem Lett21:5045-9 (2011) 
 
Myelin-associated glycoprotein
Name:Myelin-associated glycoprotein
Type:PROTEIN
Mol. Mass.:69048.07
Organism:Homo sapiens (Human)
Description:ChEMBL_770764
Residue:626
BDBM50354045
NameBDBM50354045
Synonyms:CHEMBL1836305
TypeSmall organic molecule
Emp. Form.C41H69N3O27Si
Mol. Mass.1064.0771
SMILESCC(=O)N[C@@H]1[C@@H](O)C[C@@](OC[C@H]2O[C@@H](OCC[Si](C)(C)C)[C@H](NC(C)=O)[C@@H](O[C@@H]3O[C@H](CO)[C@H](O)[C@H](O[C@@]4(C[C@H](O)[C@@H](NC(C)=O)[C@@H](O4)[C@H](O)[C@H](O)CO)C([O-])=O)[C@H]3O)[C@H]2O)(O[C@H]1[C@H](O)[C@H](O)CO)C([O-])=O