Reaction Details
TargetHypoxia-inducible factor 1-alpha
LigandBDBM50354123
Substrate/Competitorn/a
Meas. Tech.ChEMBL_770820 (CHEMBL1837625)
IC50 27600±n/a nM
Citation Huang, WHuang, RAttene-Ramos, MSSakamuru, SEnglund, EEInglese, JAustin, CPXia, M Synthesis and evaluation of quinazolin-4-ones as hypoxia-inducible factor-1a inhibitors. Bioorg Med Chem Lett21:5239-43 (2011) 
 
Hypoxia-inducible factor 1-alpha
Name:Hypoxia-inducible factor 1-alpha
Type:Protein
Mol. Mass.:92647.24
Organism:Homo sapiens (Human)
Description:Q16665
Residue:826
BDBM50354123
NameBDBM50354123
Synonyms:CHEMBL1833996
TypeSmall organic molecule
Emp. Form.C27H27N3O4
Mol. Mass.457.521
SMILESCCOc1ccccc1-n1c(CC2CCN(CC2)C(=O)c2ccco2)nc2ccccc2c1=O