Reaction Details
TargetHypoxia-inducible factor 1-alpha
LigandBDBM50354131
Substrate/Competitorn/a
Meas. Tech.ChEMBL_770820 (CHEMBL1837625)
IC50 22900±n/a nM
Citation Huang, WHuang, RAttene-Ramos, MSSakamuru, SEnglund, EEInglese, JAustin, CPXia, M Synthesis and evaluation of quinazolin-4-ones as hypoxia-inducible factor-1a inhibitors. Bioorg Med Chem Lett21:5239-43 (2011) 
 
Hypoxia-inducible factor 1-alpha
Name:Hypoxia-inducible factor 1-alpha
Type:Protein
Mol. Mass.:92647.24
Organism:Homo sapiens (Human)
Description:Q16665
Residue:826
BDBM50354131
NameBDBM50354131
Synonyms:CHEMBL1836182
TypeSmall organic molecule
Emp. Form.C26H26N4O2
Mol. Mass.426.5102
SMILESO=c1n(c(CN2CCNCC2)nc2ccccc12)-c1ccccc1OCc1ccccc1